Reaction Details
TargetCarbonic anhydrase 9
LigandBDBM50386721
Substrate/Competitorn/a
Meas. Tech.ChEMBL_826609 (CHEMBL2050863)
Ki 8.3±n/a nM
Citation Gitto, RDamiano, FMMader, PDe Luca, LFerro, SSupuran, CTVullo, DBrynda, JRezácová, PChimirri, A Synthesis, structure-activity relationship studies, and X-ray crystallographic analysis of arylsulfonamides as potent carbonic anhydrase inhibitors. J Med Chem55:3891-9 (2012) 
 
Carbonic anhydrase 9
Name:Carbonic anhydrase 9
Type:Enzyme
Mol. Mass.:49669.03
Organism:Homo sapiens (Human)
Description:Catalytic domain of human cloned isozyme was used in the assay
Residue:459
BDBM50386721
NameBDBM50386721
Synonyms:CHEMBL2048923
TypeSmall organic molecule
Emp. Form.C18H22N2O4S
Mol. Mass.362.443
SMILESCCCOc1cccc(CCNC(=O)c2ccc(cc2)S(N)(=O)=O)c1