Reaction Details
TargetCarbonic anhydrase 9
LigandBDBM10888
Substrate/Competitorn/a
Meas. Tech.ChEMBL_826609 (CHEMBL2050863)
Ki 5.1±n/a nM
Citation Gitto, RDamiano, FMMader, PDe Luca, LFerro, SSupuran, CTVullo, DBrynda, JRezácová, PChimirri, A Synthesis, structure-activity relationship studies, and X-ray crystallographic analysis of arylsulfonamides as potent carbonic anhydrase inhibitors. J Med Chem55:3891-9 (2012) 
 
Carbonic anhydrase 9
Name:Carbonic anhydrase 9
Type:Enzyme
Mol. Mass.:49669.03
Organism:Homo sapiens (Human)
Description:Catalytic domain of human cloned isozyme was used in the assay
Residue:459
BDBM10888
NameBDBM10888
Synonyms:1,2-benzoxazol-3-ylmethanesulfonamide SPR_2 Zonisamide Zonisamide (ZNS) Zonisamide, ZNS
TypeSmall organic molecule
Emp. Form.C8H8N2O3S
Mol. Mass.212.226
SMILESNS(=O)(=O)Cc1noc2ccccc12