Reaction Details
TargetReceptor-type tyrosine-protein kinase FLT3
LigandBDBM50386750
Substrate/Competitorn/a
Meas. Tech.ChEMBL_826989 (CHEMBL2050053)
IC50 7±n/a nM
Citation Li, WWWang, XYZheng, RLYan, HXCao, ZXZhong, LWang, ZRJi, PYang, LLWang, LJXu, YLiu, JJYang, JZhang, CHMa, SFeng, SSun, QZWei, YQYang, SY Discovery of the novel potent and selective FLT3 inhibitor 1-{5-[7-(3- morpholinopropoxy)quinazolin-4-ylthio]-[1,3,4]thiadiazol-2-yl}-3-p-tolylurea and its anti-acute myeloid leukemia (AML) activities in vitro and in vivo. J Med Chem55:3852-66 (2012) 
 
Receptor-type tyrosine-protein kinase FLT3
Name:Receptor-type tyrosine-protein kinase FLT3
Type:Enzyme
Mol. Mass.:112888.62
Organism:Homo sapiens (Human)
Description:P36888
Residue:993
BDBM50386750
NameBDBM50386750
Synonyms:CHEMBL2046699
TypeSmall organic molecule
Emp. Form.C13H11N3O2S2
Mol. Mass.305.375
SMILESCOc1cc2ncnc(Sc3nccs3)c2cc1OC