Reaction Details
TargetSodium/glucose cotransporter 2
LigandBDBM20878
Substrate/Competitorn/a
Meas. Tech.ChEMBL_827406 (CHEMBL2051076)
IC50 4.8±n/a nM
Citation Ohtake, YSato, TMatsuoka, HKobayashi, TNishimoto, MTaka, NTakano, KYamamoto, KOhmori, MHiguchi, TMurakata, MMorikawa, KShimma, NSuzuki, MHagita, HOzawa, KYamaguchi, KKato, MIkeda, S C-Aryl 5a-carba-ß-d-glucopyranosides as novel sodium glucose cotransporter 2 (SGLT2) inhibitors for the treatment of type 2 diabetes. Bioorg Med Chem20:4117-27 (2012) 
 
Sodium/glucose cotransporter 2
Name:Sodium/glucose cotransporter 2
Type:Protein
Mol. Mass.:72902.00
Organism:Homo sapiens (Human)
Description:P31639
Residue:672
BDBM20878
NameBDBM20878
Synonyms:(2R,3S,4S,5R,6S)-2-(hydroxymethyl)-6-{2-[(4-methoxyphenyl)methyl]phenoxy}oxane-3,4,5-triol O-glucoside, 4a
TypeSmall organic molecule
Emp. Form.C20H24O7
Mol. Mass.376.4004
SMILESCOc1ccc(Cc2ccccc2O[C@@H]2O[C@H](CO)[C@@H](O)[C@H](O)[C@H]2O)cc1