Reaction Details
TargetSodium/glucose cotransporter 2
LigandBDBM50386880
Substrate/Competitorn/a
Meas. Tech.ChEMBL_827406 (CHEMBL2051076)
IC50 11±n/a nM
Citation Ohtake, YSato, TMatsuoka, HKobayashi, TNishimoto, MTaka, NTakano, KYamamoto, KOhmori, MHiguchi, TMurakata, MMorikawa, KShimma, NSuzuki, MHagita, HOzawa, KYamaguchi, KKato, MIkeda, S C-Aryl 5a-carba-ß-d-glucopyranosides as novel sodium glucose cotransporter 2 (SGLT2) inhibitors for the treatment of type 2 diabetes. Bioorg Med Chem20:4117-27 (2012) 
 
Sodium/glucose cotransporter 2
Name:Sodium/glucose cotransporter 2
Type:Protein
Mol. Mass.:72902.00
Organism:Homo sapiens (Human)
Description:P31639
Residue:672
BDBM50386880
NameBDBM50386880
Synonyms:CHEMBL2048487
TypeSmall organic molecule
Emp. Form.C23H28O4
Mol. Mass.368.466
SMILESOC[C@H]1C[C@H]([C@H](O)[C@@H](O)[C@@H]1O)c1cccc(Cc2ccc(cc2)C2CC2)c1