Reaction Details
TargetSodium/glucose cotransporter 2
LigandBDBM50386888
Substrate/Competitorn/a
Meas. Tech.ChEMBL_827406 (CHEMBL2051076)
IC50 14±n/a nM
Citation Ohtake, YSato, TMatsuoka, HKobayashi, TNishimoto, MTaka, NTakano, KYamamoto, KOhmori, MHiguchi, TMurakata, MMorikawa, KShimma, NSuzuki, MHagita, HOzawa, KYamaguchi, KKato, MIkeda, S C-Aryl 5a-carba-ß-d-glucopyranosides as novel sodium glucose cotransporter 2 (SGLT2) inhibitors for the treatment of type 2 diabetes. Bioorg Med Chem20:4117-27 (2012) 
 
Sodium/glucose cotransporter 2
Name:Sodium/glucose cotransporter 2
Type:Protein
Mol. Mass.:72902.00
Organism:Homo sapiens (Human)
Description:P31639
Residue:672
BDBM50386888
NameBDBM50386888
Synonyms:CHEMBL2048491
TypeSmall organic molecule
Emp. Form.C23H30O6
Mol. Mass.402.4807
SMILESCCc1ccc(Cc2ccc(OC)c(c2)[C@]2(O)C[C@H](CO)[C@@H](O)[C@H](O)[C@H]2O)cc1