Reaction Details
TargetMatrix metalloproteinase-9
LigandBDBM7459
Substrate/Competitorn/a
Meas. Tech.ChEMBL_827436 (CHEMBL2051215)
IC50 5620±n/a nM
Citation Wang, LLi, XZhang, SLu, WLiao, SLiu, XShan, LShen, XJiang, HZhang, WHuang, JLi, H Natural products as a gold mine for selective matrix metalloproteinases inhibitors. Bioorg Med Chem20:4164-71 (2012) 
 
Matrix metalloproteinase-9
Name:Matrix metalloproteinase-9
Type:Enzyme
Mol. Mass.:78452.28
Organism:Homo sapiens (Human)
Description:P14780
Residue:707
BDBM7459
NameBDBM7459
Synonyms:2-(3,4-dihydroxyphenyl)-5,7-dihydroxy-4H-chromen-4-one CHEMBL151 Luteolin (4) cid_5280445 med.21724, Compound 3
TypeSmall organic molecule
Emp. Form.C15H10O6
Mol. Mass.286.2363
SMILESOc1cc(O)c2c(c1)oc(cc2=O)-c1ccc(O)c(O)c1