Reaction Details
TargetSodium-dependent dopamine transporter
LigandBDBM50386906
Substrate/Competitorn/a
Meas. Tech.ChEMBL_828549 (CHEMBL2050196)
Ki 2.64±n/a nM
Citation Qiao, HZhu, LLieberman, BPZha, ZPlössl, KKung, HF Synthesis and evaluation of novel tropane derivatives as potential PET imaging agents for the dopamine transporter. Bioorg Med Chem Lett22:4303-6 (2012) 
 
Sodium-dependent dopamine transporter
Name:Sodium-dependent dopamine transporter
Type:Multi-pass membrane protein
Mol. Mass.:68497.11
Organism:Homo sapiens (Human)
Description:Q01959
Residue:620
BDBM50386906
NameBDBM50386906
Synonyms:CHEMBL2048520
TypeSmall organic molecule
Emp. Form.C19H28ClFN2
Mol. Mass.338.89
SMILESCN(CCCF)C[C@@H]1[C@H]2CC[C@@H](C[C@@H]1c1ccc(Cl)cc1)N2C