Reaction Details
TargetGrowth hormone secretagogue receptor type 1
LigandBDBM50386958
Substrate/Competitorn/a
Meas. Tech.ChEMBL_827492 (CHEMBL2051349)
Ki 23±n/a nM
Citation Kung, DWCoffey, SBJones, RMCabral, SJiao, WFichtner, MCarpino, PARose, CRHank, RFLopaze, MGSwartz, RChen, HTHendsch, ZPosner, BWielis, CFManning, BDubins, JStock, IAVarma, SCampbell, MDeBartola, DKosa-Maines, RSteyn, SJMcClure, KF Identification of spirocyclic piperidine-azetidine inverse agonists of the ghrelin receptor. Bioorg Med Chem Lett22:4281-7 (2012) 
 
Growth hormone secretagogue receptor type 1
Name:Growth hormone secretagogue receptor type 1
Type:Receptor
Mol. Mass.:41334.57
Organism:Homo sapiens (Human)
Description:Receptor binding studies use plasma membranes from LLC PK-1 cells transiently transfected with hGHSR1a.
Residue:366
BDBM50386958
NameBDBM50386958
Synonyms:CHEMBL2048823
TypeSmall organic molecule
Emp. Form.C25H26ClN7O
Mol. Mass.475.973
SMILESClc1ccc2nc(CC(=O)N3CCC4(CN(Cc5ccc(cc5)-n5nccn5)C4)CC3)cn2c1