Reaction Details
TargetKappa-type opioid receptor
LigandBDBM50000787
Substrate/Competitorn/a
Meas. Tech.ChEMBL_827540 (CHEMBL2051481)
Ki 1.07±n/a nM
Citation Stavitskaya, LShim, JHealy, JRMatsumoto, RRMacKerell, ADCoop, A Deconstructing 14-phenylpropyloxymetopon: minimal requirements for binding to mu opioid receptors. Bioorg Med Chem20:4556-63 (2012) 
 
Kappa-type opioid receptor
Name:Kappa-type opioid receptor
Type:G Protein-Coupled Receptor (GPCR)
Mol. Mass.:42692.90
Organism:Rattus norvegicus (rat)
Description:P34975
Residue:380
BDBM50000787
NameBDBM50000787
Synonyms:(1S,5R,13R,17S)-4-(cyclopropylmethyl)-10,17-dihydroxy-12-oxa-4-azapentacyclo[9.6.1.0^{1,13}.0^{5,17}.0^{7,18}]octadeca-7(18),8,10-trien-14-one | NALTREXONE
TypeSmall organic molecule
Emp. Form.C20H23NO4
Mol. Mass.341.4009
SMILESOc1ccc2C[C@H]3N(CC4CC4)CC[C@@]45[C@@H](Oc1c24)C(=O)CC[C@@]35O