Reaction Details
TargetCytochrome P450 1A2
LigandBDBM50387086
Substrate/Competitorn/a
Meas. Tech.ChEMBL_827666 (CHEMBL2050705)
IC50>100000±n/a nM
Citation Zhang, HZhou, LAmblard, FShi, JBobeck, DRTao, SMcBrayer, TRTharnish, PMWhitaker, TCoats, SJSchinazi, RF Synthesis and evaluation of novel potent HCV NS5A inhibitors. Bioorg Med Chem Lett22:4864-8 (2012) 
 
Cytochrome P450 1A2
Name:Cytochrome P450 1A2
Type:Enzyme
Mol. Mass.:58423.38
Organism:Homo sapiens (Human)
Description:P05177
Residue:516
BDBM50387086
NameBDBM50387086
Synonyms:CHEMBL2047191
TypeSmall organic molecule
Emp. Form.C40H48F2N8O6
Mol. Mass.774.8559
SMILESCOC(=O)N[C@@H](C(C)C)C(=O)N1CCC[C@H]1c1nc(c(F)[nH]1)-c1ccc(cc1)-c1ccc(cc1)-c1nc([nH]c1F)[C@@H]1CCCN1C(=O)[C@@H](NC(=O)OC)C(C)C