Reaction Details
TargetCytochrome P450 3A4
LigandBDBM50387085
Substrate/Competitorn/a
Meas. Tech.ChEMBL_827667 (CHEMBL2050706)
IC50 13800±n/a nM
Citation Zhang, HZhou, LAmblard, FShi, JBobeck, DRTao, SMcBrayer, TRTharnish, PMWhitaker, TCoats, SJSchinazi, RF Synthesis and evaluation of novel potent HCV NS5A inhibitors. Bioorg Med Chem Lett22:4864-8 (2012) 
 
Cytochrome P450 3A4
Name:Cytochrome P450 3A4
Type:Enzyme
Mol. Mass.:57349.57
Organism:Homo sapiens (Human)
Description:n/a
Residue:503
BDBM50387085
NameBDBM50387085
Synonyms:CHEMBL2047188
TypeSmall organic molecule
Emp. Form.C40H48Cl2N8O6
Mol. Mass.807.765
SMILESCOC(=O)N[C@@H](C(C)C)C(=O)N1CCC[C@H]1c1nc(c(Cl)[nH]1)-c1ccc(cc1)-c1ccc(cc1)-c1nc([nH]c1Cl)[C@@H]1CCCN1C(=O)[C@@H](NC(=O)OC)C(C)C