Reaction Details
TargetCarbonic anhydrase 1
LigandBDBM50387114
Substrate/Competitorn/a
Meas. Tech.ChEMBL_827862 (CHEMBL2051271)
Ki 3240±n/a nM
Citation Winum, JYCarta, FWard, CMullen, PHarrison, DLangdon, SPCecchi, AScozzafava, AKunkler, ISupuran, CT Ureido-substituted sulfamates show potent carbonic anhydrase IX inhibitory and antiproliferative activities against breast cancer cell lines. Bioorg Med Chem Lett22:4681-5 (2012) 
 
Carbonic anhydrase 1
Name:Carbonic anhydrase 1
Type:Enzyme
Mol. Mass.:28873.37
Organism:Homo sapiens (Human)
Description:P00915
Residue:261
BDBM50387114
NameBDBM50387114
Synonyms:CHEMBL2047796
TypeSmall organic molecule
Emp. Form.C13H13N3O4S
Mol. Mass.307.325
SMILESNS(=O)(=O)Oc1ccc(NC(=O)Nc2ccccc2)cc1