Reaction Details
TargetCarbonic anhydrase 12
LigandBDBM50387114
Substrate/Competitorn/a
Meas. Tech.ChEMBL_827865 (CHEMBL2051274)
Ki 10±n/a nM
Citation Winum, JYCarta, FWard, CMullen, PHarrison, DLangdon, SPCecchi, AScozzafava, AKunkler, ISupuran, CT Ureido-substituted sulfamates show potent carbonic anhydrase IX inhibitory and antiproliferative activities against breast cancer cell lines. Bioorg Med Chem Lett22:4681-5 (2012) 
 
Carbonic anhydrase 12
Name:Carbonic anhydrase 12
Type:Enzyme
Mol. Mass.:39456.00
Organism:Homo sapiens (Human)
Description:Catalytic domain of human cloned isozyme was used in the assay
Residue:354
BDBM50387114
NameBDBM50387114
Synonyms:CHEMBL2047796
TypeSmall organic molecule
Emp. Form.C13H13N3O4S
Mol. Mass.307.325
SMILESNS(=O)(=O)Oc1ccc(NC(=O)Nc2ccccc2)cc1