Reaction Details
TargetCarbonic anhydrase 9
LigandBDBM50387117
Substrate/Competitorn/a
Meas. Tech.ChEMBL_827864 (CHEMBL2051273)
Ki 15±n/a nM
Citation Winum, JYCarta, FWard, CMullen, PHarrison, DLangdon, SPCecchi, AScozzafava, AKunkler, ISupuran, CT Ureido-substituted sulfamates show potent carbonic anhydrase IX inhibitory and antiproliferative activities against breast cancer cell lines. Bioorg Med Chem Lett22:4681-5 (2012) 
 
Carbonic anhydrase 9
Name:Carbonic anhydrase 9
Type:Enzyme
Mol. Mass.:49669.03
Organism:Homo sapiens (Human)
Description:Catalytic domain of human cloned isozyme was used in the assay
Residue:459
BDBM50387117
NameBDBM50387117
Synonyms:4-ureidophenyl sulfamate ring derivative 3g | CHEMBL2047802
TypeSmall organic molecule
Emp. Form.C14H15N3O5S
Mol. Mass.337.351
SMILESCOc1ccc(NC(=O)Nc2ccc(OS(N)(=O)=O)cc2)cc1