Reaction Details
TargetCarbonic anhydrase 1
LigandBDBM50387133
Substrate/Competitorn/a
Meas. Tech.ChEMBL_827862 (CHEMBL2051271)
Ki 8700±n/a nM
Citation Winum, JYCarta, FWard, CMullen, PHarrison, DLangdon, SPCecchi, AScozzafava, AKunkler, ISupuran, CT Ureido-substituted sulfamates show potent carbonic anhydrase IX inhibitory and antiproliferative activities against breast cancer cell lines. Bioorg Med Chem Lett22:4681-5 (2012) 
 
Carbonic anhydrase 1
Name:Carbonic anhydrase 1
Type:Enzyme
Mol. Mass.:28873.37
Organism:Homo sapiens (Human)
Description:P00915
Residue:261
BDBM50387133
NameBDBM50387133
Synonyms:CHEMBL2047813
TypeSmall organic molecule
Emp. Form.C17H15N3O4S
Mol. Mass.357.384
SMILESNS(=O)(=O)Oc1ccc(NC(=O)Nc2cccc3ccccc23)cc1