Reaction Details
TargetCarbonic anhydrase 1
LigandBDBM50387140
Substrate/Competitorn/a
Meas. Tech.ChEMBL_827862 (CHEMBL2051271)
Ki 2960±n/a nM
Citation Winum, JYCarta, FWard, CMullen, PHarrison, DLangdon, SPCecchi, AScozzafava, AKunkler, ISupuran, CT Ureido-substituted sulfamates show potent carbonic anhydrase IX inhibitory and antiproliferative activities against breast cancer cell lines. Bioorg Med Chem Lett22:4681-5 (2012) 
 
Carbonic anhydrase 1
Name:Carbonic anhydrase 1
Type:Enzyme
Mol. Mass.:28873.37
Organism:Homo sapiens (Human)
Description:P00915
Residue:261
BDBM50387140
NameBDBM50387140
Synonyms:4-ureidophenyl sulfamate ring derivative 3z | CHEMBL2047820
TypeSmall organic molecule
Emp. Form.C15H17N3O5S
Mol. Mass.351.378
SMILESCOc1ccc(NC(=O)Nc2ccc(OS(N)(=O)=O)cc2)c(C)c1