Reaction Details
TargetCarbonic anhydrase 12
LigandBDBM50387142
Substrate/Competitorn/a
Meas. Tech.ChEMBL_827865 (CHEMBL2051274)
Ki 69±n/a nM
Citation Winum, JYCarta, FWard, CMullen, PHarrison, DLangdon, SPCecchi, AScozzafava, AKunkler, ISupuran, CT Ureido-substituted sulfamates show potent carbonic anhydrase IX inhibitory and antiproliferative activities against breast cancer cell lines. Bioorg Med Chem Lett22:4681-5 (2012) 
 
Carbonic anhydrase 12
Name:Carbonic anhydrase 12
Type:Enzyme
Mol. Mass.:39456.00
Organism:Homo sapiens (Human)
Description:Catalytic domain of human cloned isozyme was used in the assay
Residue:354
BDBM50387142
NameBDBM50387142
Synonyms:CHEMBL2047822
TypeSmall organic molecule
Emp. Form.C19H17N3O5S
Mol. Mass.399.42
SMILESNS(=O)(=O)Oc1ccc(NC(=O)Nc2ccccc2Oc2ccccc2)cc1