Reaction Details
TargetCarbonic anhydrase 12
LigandBDBM50387152
Substrate/Competitorn/a
Meas. Tech.ChEMBL_827865 (CHEMBL2051274)
Ki 4±n/a nM
Citation Winum, JYCarta, FWard, CMullen, PHarrison, DLangdon, SPCecchi, AScozzafava, AKunkler, ISupuran, CT Ureido-substituted sulfamates show potent carbonic anhydrase IX inhibitory and antiproliferative activities against breast cancer cell lines. Bioorg Med Chem Lett22:4681-5 (2012) 
 
Carbonic anhydrase 12
Name:Carbonic anhydrase 12
Type:Enzyme
Mol. Mass.:39456.00
Organism:Homo sapiens (Human)
Description:Catalytic domain of human cloned isozyme was used in the assay
Residue:354
BDBM50387152
NameBDBM50387152
Synonyms:4-ureidophenyl sulfamate ring derivative 3ap | CHEMBL2047834
TypeSmall organic molecule
Emp. Form.C14H15N3O4S2
Mol. Mass.353.417
SMILESCSc1cccc(NC(=O)Nc2ccc(OS(N)(=O)=O)cc2)c1