Reaction Details
TargetCarbonic anhydrase 1
LigandBDBM50387161
Substrate/Competitorn/a
Meas. Tech.ChEMBL_827862 (CHEMBL2051271)
Ki 7640±n/a nM
Citation Winum, JYCarta, FWard, CMullen, PHarrison, DLangdon, SPCecchi, AScozzafava, AKunkler, ISupuran, CT Ureido-substituted sulfamates show potent carbonic anhydrase IX inhibitory and antiproliferative activities against breast cancer cell lines. Bioorg Med Chem Lett22:4681-5 (2012) 
 
Carbonic anhydrase 1
Name:Carbonic anhydrase 1
Type:Enzyme
Mol. Mass.:28873.37
Organism:Homo sapiens (Human)
Description:P00915
Residue:261
BDBM50387161
NameBDBM50387161
Synonyms:4-ureidophenyl sulfamate ring derivative 3aw | CHEMBL2047843
TypeSmall organic molecule
Emp. Form.C17H26N4O6S
Mol. Mass.414.477
SMILESCC(C)(C)OC(=O)N1CCC(CC1)NC(=O)Nc1ccc(OS(N)(=O)=O)cc1