Reaction Details
TargetCarbonic anhydrase 1
LigandBDBM50387163
Substrate/Competitorn/a
Meas. Tech.ChEMBL_827862 (CHEMBL2051271)
Ki 3095±n/a nM
Citation Winum, JYCarta, FWard, CMullen, PHarrison, DLangdon, SPCecchi, AScozzafava, AKunkler, ISupuran, CT Ureido-substituted sulfamates show potent carbonic anhydrase IX inhibitory and antiproliferative activities against breast cancer cell lines. Bioorg Med Chem Lett22:4681-5 (2012) 
 
Carbonic anhydrase 1
Name:Carbonic anhydrase 1
Type:Enzyme
Mol. Mass.:28873.37
Organism:Homo sapiens (Human)
Description:P00915
Residue:261
BDBM50387163
NameBDBM50387163
Synonyms:4-ureidophenyl sulfamate ring derivative 3bb | CHEMBL2047845
TypeSmall organic molecule
Emp. Form.C14H16N4O4S
Mol. Mass.336.366
SMILESNS(=O)(=O)Oc1ccc(NC(=O)NCCc2ccccn2)cc1