Reaction Details
TargetRenin
LigandBDBM50387284
Substrate/Competitorn/a
Meas. Tech.ChEMBL_827988 (CHEMBL2051643)
IC50 1.7±n/a nM
Citation Nakamura, YSugita, CMeguro, MMiyazaki, STamaki, KTakahashi, MNagai, YNagayama, TKato, MSuemune, HNishi, T Design and optimization of novel (2S,4S,5S)-5-amino-6-(2,2-dimethyl-5-oxo-4-phenylpiperazin-1-yl)-4-hydroxy-2-isopropylhexanamides as renin inhibitors. Bioorg Med Chem Lett22:4561-6 (2012) 
 
Renin
Name:Renin
Type:Enzyme
Mol. Mass.:45058.99
Organism:Homo sapiens (Human)
Description:n/a
Residue:406
BDBM50387284
NameBDBM50387284
Synonyms:CHEMBL2048570
TypeSmall organic molecule
Emp. Form.C27H45N5O4
Mol. Mass.503.6773
SMILESCC(C)[C@H](C[C@H](O)[C@@H](N)CN1CC(=O)N(CC1(C)C)c1ccccc1C)C(=O)NCC(C)(C)C(N)=O