Reaction Details
TargetSolute carrier family 12 member 5
LigandBDBM50387287
Substrate/Competitorn/a
Meas. Tech.ChEMBL_828024 (CHEMBL2049718)
IC50 2900±n/a nM
Citation Delpire, EBaranczak, AWaterson, AGKim, KKett, NMorrison, RDDaniels, JSWeaver, CDLindsley, CW Further optimization of the K-Cl cotransporter KCC2 antagonist ML077: development of a highly selective and more potent in vitro probe. Bioorg Med Chem Lett22:4532-5 (2012) 
 
Solute carrier family 12 member 5
Name:Solute carrier family 12 member 5
Type:PROTEIN
Mol. Mass.:126185.18
Organism:Homo sapiens (Human)
Description:ChEMBL_828024
Residue:1139
BDBM50387287
NameBDBM50387287
Synonyms:CHEMBL2048848
TypeSmall organic molecule
Emp. Form.C18H17N3OS2
Mol. Mass.355.477
SMILESCN(C(=O)CSc1ccc(cn1)-c1ccccc1)c1nc(C)cs1