Reaction Details
TargetSolute carrier family 12 member 5
LigandBDBM50387288
Substrate/Competitorn/a
Meas. Tech.ChEMBL_828024 (CHEMBL2049718)
IC50 570±n/a nM
Citation Delpire, EBaranczak, AWaterson, AGKim, KKett, NMorrison, RDDaniels, JSWeaver, CDLindsley, CW Further optimization of the K-Cl cotransporter KCC2 antagonist ML077: development of a highly selective and more potent in vitro probe. Bioorg Med Chem Lett22:4532-5 (2012) 
 
Solute carrier family 12 member 5
Name:Solute carrier family 12 member 5
Type:PROTEIN
Mol. Mass.:126185.18
Organism:Homo sapiens (Human)
Description:ChEMBL_828024
Residue:1139
BDBM50387288
NameBDBM50387288
Synonyms:CHEMBL2048853
TypeSmall organic molecule
Emp. Form.C20H20N4OS2
Mol. Mass.396.529
SMILESCC(Sc1ccc(nn1)-c1ccccc1)C(=O)N(C1CC1)c1nc(C)cs1