Reaction Details
TargetSerine/threonine-protein kinase pim-1
LigandBDBM50387306
Substrate/Competitorn/a
Meas. Tech.ChEMBL_828045 (CHEMBL2049739)
IC50 18±n/a nM
Citation Dakin, LABlock, MHChen, HCode, EDowling, JEFeng, XFerguson, ADGreen, IHird, AWHoward, TKeeton, EKLamb, MLLyne, PDPollard, HRead, JWu, AJZhang, TZheng, X Discovery of novel benzylidene-1,3-thiazolidine-2,4-diones as potent and selective inhibitors of the PIM-1, PIM-2, and PIM-3 protein kinases. Bioorg Med Chem Lett22:4599-604 (2012) 
 
Serine/threonine-protein kinase pim-1
Name:Serine/threonine-protein kinase pim-1
Type:Protein
Mol. Mass.:35681.82
Organism:Homo sapiens (Human)
Description:P11309
Residue:313
BDBM50387306
NameBDBM50387306
Synonyms:CHEMBL2048864
TypeSmall organic molecule
Emp. Form.C14H14ClN3O2S
Mol. Mass.323.798
SMILESOC1=NC(=O)C(S1)=Cc1cccc(Cl)c1N1CCNCC1