Reaction Details
TargetSerine/threonine-protein kinase pim-3
LigandBDBM50387299
Substrate/Competitorn/a
Meas. Tech.ChEMBL_828047 (CHEMBL2049741)
IC50 4±n/a nM
Citation Dakin, LABlock, MHChen, HCode, EDowling, JEFeng, XFerguson, ADGreen, IHird, AWHoward, TKeeton, EKLamb, MLLyne, PDPollard, HRead, JWu, AJZhang, TZheng, X Discovery of novel benzylidene-1,3-thiazolidine-2,4-diones as potent and selective inhibitors of the PIM-1, PIM-2, and PIM-3 protein kinases. Bioorg Med Chem Lett22:4599-604 (2012) 
 
Serine/threonine-protein kinase pim-3
Name:Serine/threonine-protein kinase pim-3
Type:Protein
Mol. Mass.:35888.19
Organism:Homo sapiens (Human)
Description:Q86V86
Residue:326
BDBM50387299
NameBDBM50387299
Synonyms:CHEMBL2048873
TypeSmall organic molecule
Emp. Form.C20H20N4O2S
Mol. Mass.380.463
SMILESN[C@@H]1CCCN(C1)c1c(C=C2SC(O)=NC2=O)cccc1-c1ccncc1