Reaction Details
TargetSerine/threonine-protein kinase pim-1
LigandBDBM50387294
Substrate/Competitorn/a
Meas. Tech.ChEMBL_828048 (CHEMBL2049742)
IC50 10±n/a nM
Citation Dakin, LABlock, MHChen, HCode, EDowling, JEFeng, XFerguson, ADGreen, IHird, AWHoward, TKeeton, EKLamb, MLLyne, PDPollard, HRead, JWu, AJZhang, TZheng, X Discovery of novel benzylidene-1,3-thiazolidine-2,4-diones as potent and selective inhibitors of the PIM-1, PIM-2, and PIM-3 protein kinases. Bioorg Med Chem Lett22:4599-604 (2012) 
 
Serine/threonine-protein kinase pim-1
Name:Serine/threonine-protein kinase pim-1
Type:Protein
Mol. Mass.:35681.82
Organism:Homo sapiens (Human)
Description:P11309
Residue:313
BDBM50387294
NameBDBM50387294
Synonyms:CHEMBL2048869
TypeSmall organic molecule
Emp. Form.C17H21N3O3S
Mol. Mass.347.432
SMILESCCOc1cccc(C=C2SC(O)=NC2=O)c1N1CCC[C@@H](N)C1