Reaction Details
TargetSerine/threonine-protein kinase pim-3
LigandBDBM50387295
Substrate/Competitorn/a
Meas. Tech.ChEMBL_828050 (CHEMBL2049744)
IC50 10±n/a nM
Citation Dakin, LABlock, MHChen, HCode, EDowling, JEFeng, XFerguson, ADGreen, IHird, AWHoward, TKeeton, EKLamb, MLLyne, PDPollard, HRead, JWu, AJZhang, TZheng, X Discovery of novel benzylidene-1,3-thiazolidine-2,4-diones as potent and selective inhibitors of the PIM-1, PIM-2, and PIM-3 protein kinases. Bioorg Med Chem Lett22:4599-604 (2012) 
 
Serine/threonine-protein kinase pim-3
Name:Serine/threonine-protein kinase pim-3
Type:Protein
Mol. Mass.:35888.19
Organism:Homo sapiens (Human)
Description:Q86V86
Residue:326
BDBM50387295
NameBDBM50387295
Synonyms:CHEMBL2048868
TypeSmall organic molecule
Emp. Form.C16H19N3O3S
Mol. Mass.333.405
SMILESCOc1cccc(C=C2SC(O)=NC2=O)c1N1CCC[C@@H](N)C1