Reaction Details
TargetProtein kinase C alpha type
LigandBDBM50387349
Substrate/Competitorn/a
Meas. Tech.ChEMBL_828100 (CHEMBL2049839)
Ki 49±n/a nM
Citation Jimenez, JMDavis, CBoyall, DFraysse, DKnegtel, RSettimo, LYoung, SBolton, CChiu, PCurnock, ARasmussen, RTanner, AAger, I Structure-based optimization of aminopyridines as PKC¿ inhibitors. Bioorg Med Chem Lett22:4645-9 (2012) 
 
Protein kinase C alpha type
Name:Protein kinase C alpha type
Type:Enzyme
Mol. Mass.:76755.65
Organism:Homo sapiens (Human)
Description:The recombinant human PKC enzymes were produced using a baculovirus expression system in SF9 cells
Residue:672
BDBM50387349
NameBDBM50387349
Synonyms:CHEMBL2046644
TypeSmall organic molecule
Emp. Form.C19H24ClN5O
Mol. Mass.373.88
SMILESCC(C)C[C@H]1CN(CCN1)c1ccc(Cl)c(n1)C(=O)c1cccnc1N