Reaction Details
TargetProtein kinase C delta type
LigandBDBM50387352
Substrate/Competitorn/a
Meas. Tech.ChEMBL_828099 (CHEMBL2049838)
Ki 30±n/a nM
Citation Jimenez, JMDavis, CBoyall, DFraysse, DKnegtel, RSettimo, LYoung, SBolton, CChiu, PCurnock, ARasmussen, RTanner, AAger, I Structure-based optimization of aminopyridines as PKC¿ inhibitors. Bioorg Med Chem Lett22:4645-9 (2012) 
 
Protein kinase C delta type
Name:Protein kinase C delta type
Type:Enzyme
Mol. Mass.:77516.79
Organism:Homo sapiens (Human)
Description:The recombinant human PKC enzymes were produced using a baculovirus expression system in SF9 cells
Residue:676
BDBM50387352
NameBDBM50387352
Synonyms:CHEMBL2046648
TypeSmall organic molecule
Emp. Form.C22H31N5O
Mol. Mass.381.5144
SMILESCCCc1ccc(nc1C(=O)c1cccnc1N)N1CCN[C@@H](CC(C)C)C1