Reaction Details
TargetProtein kinase C delta type
LigandBDBM50387353
Substrate/Competitorn/a
Meas. Tech.ChEMBL_828099 (CHEMBL2049838)
Ki>2000±n/a nM
Citation Jimenez, JMDavis, CBoyall, DFraysse, DKnegtel, RSettimo, LYoung, SBolton, CChiu, PCurnock, ARasmussen, RTanner, AAger, I Structure-based optimization of aminopyridines as PKC¿ inhibitors. Bioorg Med Chem Lett22:4645-9 (2012) 
 
Protein kinase C delta type
Name:Protein kinase C delta type
Type:Enzyme
Mol. Mass.:77516.79
Organism:Homo sapiens (Human)
Description:The recombinant human PKC enzymes were produced using a baculovirus expression system in SF9 cells
Residue:676
BDBM50387353
NameBDBM50387353
Synonyms:CHEMBL2046650
TypeSmall organic molecule
Emp. Form.C26H31N5O
Mol. Mass.429.5572
SMILESCC(C)C[C@H]1CN(CCN1)c1ccc(Cc2ccccc2)c(n1)C(=O)c1cccnc1N