Reaction Details
TargetProtein kinase C theta type
LigandBDBM50387329
Substrate/Competitorn/a
Meas. Tech.ChEMBL_828101 (CHEMBL2049840)
IC50 2600±n/a nM
Citation Jimenez, JMDavis, CBoyall, DFraysse, DKnegtel, RSettimo, LYoung, SBolton, CChiu, PCurnock, ARasmussen, RTanner, AAger, I Structure-based optimization of aminopyridines as PKC¿ inhibitors. Bioorg Med Chem Lett22:4645-9 (2012) 
 
Protein kinase C theta type
Name:Protein kinase C theta type
Type:Serine/threonine-protein kinase
Mol. Mass.:81878.04
Organism:Homo sapiens (Human)
Description:Full-length human PKC theta (Panvera Catalog No. P2996).
Residue:706
BDBM50387329
NameBDBM50387329
Synonyms:CHEMBL2046645
TypeSmall organic molecule
Emp. Form.C22H29N5O
Mol. Mass.379.4986
SMILESCC(C)C[C@H]1CN(CCN1)c1ccc(C2CC2)c(n1)C(=O)c1cccnc1N