Reaction Details
TargetMitogen-activated protein kinase 10
LigandBDBM50387330
Substrate/Competitorn/a
Meas. Tech.ChEMBL_828124 (CHEMBL2049863)
Ki>4000±n/a nM
Citation Jimenez, JMDavis, CBoyall, DFraysse, DKnegtel, RSettimo, LYoung, SBolton, CChiu, PCurnock, ARasmussen, RTanner, AAger, I Structure-based optimization of aminopyridines as PKC¿ inhibitors. Bioorg Med Chem Lett22:4645-9 (2012) 
 
Mitogen-activated protein kinase 10
Name:Mitogen-activated protein kinase 10
Type:Enzyme
Mol. Mass.:52586.89
Organism:Homo sapiens (Human)
Description:n/a
Residue:464
BDBM50387330
NameBDBM50387330
Synonyms:CHEMBL2046643
TypeSmall organic molecule
Emp. Form.C20H24F3N5O
Mol. Mass.407.4327
SMILESCC(C)C[C@H]1CN(CCN1)c1ccc(c(n1)C(=O)c1cccnc1N)C(F)(F)F