Reaction Details
TargetVesicular acetylcholine transporter
LigandBDBM50046952
Substrate/Competitorn/a
Meas. Tech.ChEMBL_828208 (CHEMBL2050140)
Ki 0.22±n/a nM
Citation Tu, ZWang, WCui, JZhang, XLu, XXu, JParsons, SM Synthesis and evaluation of in vitro bioactivity for vesicular acetylcholine transporter inhibitors containing two carbonyl groups. Bioorg Med Chem20:4422-9 (2012) 
 
Vesicular acetylcholine transporter
Name:Vesicular acetylcholine transporter
Type:PROTEIN
Mol. Mass.:56900.67
Organism:Homo sapiens (Human)
Description:ChEMBL_1507628
Residue:532
BDBM50046952
NameBDBM50046952
Synonyms:(3'R,4'R)-1'-(4-Fluoro-benzyl)-4-phenyl-[1,3']bipiperidinyl-4'-ol CHEMBL1956464 trans-1-(4-fluorobenzyl)-3-(4-phenylpiperidin-1-yl)piperidin-4-ol
TypeSmall organic molecule
Emp. Form.C23H29FN2O
Mol. Mass.368.4876
SMILESO[C@@H]1CCN(Cc2ccc(F)cc2)C[C@H]1N1CCC(CC1)c1ccccc1