Reaction Details
TargetVascular endothelial growth factor receptor 2
LigandBDBM50387417
Substrate/Competitorn/a
Meas. Tech.ChEMBL_828212 (CHEMBL2050144)
IC50 89300±n/a nM
Citation Gangjee, AZhao, YIhnat, MAThorpe, JEBailey-Downs, LCKisliuk, RL Novel tricyclic indeno[2,1-d]pyrimidines with dual antiangiogenic and cytotoxic activities as potent antitumor agents. Bioorg Med Chem20:4217-25 (2012) 
 
Vascular endothelial growth factor receptor 2
Name:Vascular endothelial growth factor receptor 2
Type:Receptor Tyrosine Kinase
Mol. Mass.:151510.97
Organism:Homo sapiens (Human)
Description:P35968
Residue:1356
BDBM50387417
NameBDBM50387417
Synonyms:CHEMBL2047241
TypeSmall organic molecule
Emp. Form.C17H13FN4
Mol. Mass.292.3103
SMILESNc1nc2cc3ccccc3c2c(Nc2ccc(F)cc2)[nH]1