Reaction Details
TargetBifunctional dihydrofolate reductase-thymidylate synthase
LigandBDBM50387410
Substrate/Competitorn/a
Meas. Tech.ChEMBL_828285 (CHEMBL2050304)
IC50>16000±n/a nM
Citation Gangjee, AZhao, YIhnat, MAThorpe, JEBailey-Downs, LCKisliuk, RL Novel tricyclic indeno[2,1-d]pyrimidines with dual antiangiogenic and cytotoxic activities as potent antitumor agents. Bioorg Med Chem20:4217-25 (2012) 
 
Bifunctional dihydrofolate reductase-thymidylate synthase
Name:Bifunctional dihydrofolate reductase-thymidylate synthase
Type:Enzyme
Mol. Mass.:68757.49
Organism:Toxoplasma gondii
Description:Q07422
Residue:610
BDBM50387410
NameBDBM50387410
Synonyms:CHEMBL2047247
TypeSmall organic molecule
Emp. Form.C17H13ClN4
Mol. Mass.308.765
SMILESNc1nc2cc3ccccc3c2c(Nc2ccc(Cl)cc2)[nH]1