Reaction Details
TargetThymidylate synthase
LigandBDBM50387412
Substrate/Competitorn/a
Meas. Tech.ChEMBL_828286 (CHEMBL2050305)
IC50>13000±n/a nM
Citation Gangjee, AZhao, YIhnat, MAThorpe, JEBailey-Downs, LCKisliuk, RL Novel tricyclic indeno[2,1-d]pyrimidines with dual antiangiogenic and cytotoxic activities as potent antitumor agents. Bioorg Med Chem20:4217-25 (2012) 
 
Thymidylate synthase
Name:Thymidylate synthase
Type:Enzyme
Mol. Mass.:35718.07
Organism:Homo sapiens (Human)
Description:n/a
Residue:313
BDBM50387412
NameBDBM50387412
Synonyms:CHEMBL2047252
TypeSmall organic molecule
Emp. Form.C17H12ClFN4
Mol. Mass.326.755
SMILESNc1nc2cc3ccccc3c2c(Nc2ccc(F)c(Cl)c2)[nH]1