Reaction Details
TargetDihydrofolate reductase
LigandBDBM50387410
Substrate/Competitorn/a
Meas. Tech.ChEMBL_828283 (CHEMBL2050302)
IC50>16000±n/a nM
Citation Gangjee, AZhao, YIhnat, MAThorpe, JEBailey-Downs, LCKisliuk, RL Novel tricyclic indeno[2,1-d]pyrimidines with dual antiangiogenic and cytotoxic activities as potent antitumor agents. Bioorg Med Chem20:4217-25 (2012) 
 
Dihydrofolate reductase
Name:Dihydrofolate reductase
Type:Enzyme
Mol. Mass.:21453.99
Organism:Homo sapiens (Human)
Description:Recombinant human DHFR.
Residue:187
BDBM50387410
NameBDBM50387410
Synonyms:CHEMBL2047247
TypeSmall organic molecule
Emp. Form.C17H13ClN4
Mol. Mass.308.765
SMILESNc1nc2cc3ccccc3c2c(Nc2ccc(Cl)cc2)[nH]1