Reaction Details
TargetDihydrofolate reductase
LigandBDBM18512
Substrate/Competitorn/a
Meas. Tech.ChEMBL_828283 (CHEMBL2050302)
IC50 6000±n/a nM
Citation Gangjee, AZhao, YIhnat, MAThorpe, JEBailey-Downs, LCKisliuk, RL Novel tricyclic indeno[2,1-d]pyrimidines with dual antiangiogenic and cytotoxic activities as potent antitumor agents. Bioorg Med Chem20:4217-25 (2012) 
 
Dihydrofolate reductase
Name:Dihydrofolate reductase
Type:Enzyme
Mol. Mass.:21453.99
Organism:Homo sapiens (Human)
Description:Recombinant human DHFR.
Residue:187
BDBM18512
NameBDBM18512
Synonyms:5-(4-chlorophenyl)-6-ethylpyrimidine-2,4-diamine Pyrimethamine (Pyr) cid_4993
TypeSmall organic molecule
Emp. Form.C12H13ClN4
Mol. Mass.248.711
SMILESCCc1nc(N)nc(N)c1-c1ccc(Cl)cc1