Reaction Details
TargetEpidermal growth factor receptor
LigandBDBM50387411
Substrate/Competitorn/a
Meas. Tech.ChEMBL_828211 (CHEMBL2050143)
IC50>200000±n/a nM
Citation Gangjee, AZhao, YIhnat, MAThorpe, JEBailey-Downs, LCKisliuk, RL Novel tricyclic indeno[2,1-d]pyrimidines with dual antiangiogenic and cytotoxic activities as potent antitumor agents. Bioorg Med Chem20:4217-25 (2012) 
 
Epidermal growth factor receptor
Name:Epidermal growth factor receptor
Type:Receptor Kinase Domain
Mol. Mass.:134279.59
Organism:Homo sapiens (Human)
Description:P00533
Residue:1210
BDBM50387411
NameBDBM50387411
Synonyms:CHEMBL2047251
TypeSmall organic molecule
Emp. Form.C18H16N4O
Mol. Mass.304.3458
SMILESCOc1cccc(Nc2[nH]c(N)nc3cc4ccccc4c23)c1