Reaction Details
TargetHistamine H4 receptor
LigandBDBM50387434
Substrate/Competitorn/a
Meas. Tech.ChEMBL_828300 (CHEMBL2050319)
Ki 6.31±n/a nM
Citation Engelhardt, Hde Esch, IJKuhn, DSmits, RAZuiderveld, OPDobler, JMayer, MLips, SArnhof, HScharn, DHaaksma, EELeurs, R Detailed structure-activity relationship of indolecarboxamides as H4 receptor ligands. Eur J Med Chem54:660-8 (2012) 
 
Histamine H4 receptor
Name:Histamine H4 receptor
Type:G Protein-Coupled Receptor (GPCR)
Mol. Mass.:44517.02
Organism:Homo sapiens (Human)
Description:Binding assays were using CHO cells stably expressing hH4R receptors.
Residue:390
BDBM50387434
NameBDBM50387434
Synonyms:CHEMBL2047447
TypeSmall organic molecule
Emp. Form.C14H15ClFN3O
Mol. Mass.295.74
SMILESCN1CCN(CC1)C(=O)c1cc2c(F)c(Cl)ccc2[nH]1