Reaction Details
TargetProtein arginine N-methyltransferase 1 [11-371]
LigandBDBM50387479
Substrate/Competitorn/a
Meas. Tech.ChEMBL_828306 (CHEMBL2050325)
IC50 15500±n/a nM
Citation Sinha, SHOwens, EAFeng, YYang, YXie, YTu, YHenary, MZheng, YG Synthesis and evaluation of carbocyanine dyes as PRMT inhibitors and imaging agents. Eur J Med Chem54:647-59 (2012) 
 
Protein arginine N-methyltransferase 1 [11-371]
Name:Protein arginine N-methyltransferase 1 [11-371]
Type:Protein
Mol. Mass.:41506.52
Organism:Homo sapiens (Human)
Description:Q99873[11-371]
Residue:361
BDBM50387479
NameBDBM50387479
Synonyms:CHEMBL2047478
TypeSmall organic molecule
Emp. Form.C43H37N2
Mol. Mass.581.7667
SMILESC(Cc1ccccc1)Cn1c2cccc3cccc(c23)\c1=C\[CH+]\C=c1/n(CCCc2ccccc2)c2cccc3cccc1c23