Reaction Details
TargetProtein arginine N-methyltransferase 5
LigandBDBM50387477
Substrate/Competitorn/a
Meas. Tech.ChEMBL_828319 (CHEMBL2050393)
IC50 9100±n/a nM
Citation Sinha, SHOwens, EAFeng, YYang, YXie, YTu, YHenary, MZheng, YG Synthesis and evaluation of carbocyanine dyes as PRMT inhibitors and imaging agents. Eur J Med Chem54:647-59 (2012) 
 
Protein arginine N-methyltransferase 5
Name:Protein arginine N-methyltransferase 5
Type:Enzyme
Mol. Mass.:72679.99
Organism:Homo sapiens (Human)
Description:O14744
Residue:637
BDBM50387477
NameBDBM50387477
Synonyms:CHEMBL2047477
TypeSmall organic molecule
Emp. Form.C29H25N2
Mol. Mass.401.5217
SMILESCCn1c2cccc3cccc(c23)\c1=C\[CH+]\C=c1/n(CC)c2cccc3cccc1c23