Reaction Details
TargetCalcitonin gene-related peptide type 1 receptor
LigandBDBM50387498
Substrate/Competitorn/a
Meas. Tech.ChEMBL_830172 (CHEMBL2061982)
Ki 7.2±n/a nM
Citation Han, XCiviello, RLConway, CMCook, DADavis, CDMacci, RPin, SSRen, SXSchartman, RSignor, LJThalody, GWidmann, KAXu, CChaturvedula, PVMacor, JEDubowchik, GM The synthesis and SAR of calcitonin gene-related peptide (CGRP) receptor antagonists derived from tyrosine surrogates. Part 1. Bioorg Med Chem Lett22:4723-7 (2012) 
 
Calcitonin gene-related peptide type 1 receptor
Name:Calcitonin gene-related peptide type 1 receptor
Type:Enzyme Catalytic Domain
Mol. Mass.:52980.45
Organism:Homo sapiens (Human)
Description:Q16602
Residue:461
BDBM50387498
NameBDBM50387498
Synonyms:CHEMBL2059798
TypeSmall organic molecule
Emp. Form.C36H44N6O3
Mol. Mass.608.773
SMILESO=C(N[C@H](Cc1cccc2ccccc12)C(=O)N1CCC(CC1)N1CCCCC1)N1CCC(CC1)n1c2ccccc2[nH]c1=O