Reaction Details
TargetCalcitonin gene-related peptide type 1 receptor
LigandBDBM50387500
Substrate/Competitorn/a
Meas. Tech.ChEMBL_830172 (CHEMBL2061982)
Ki 250±n/a nM
Citation Han, XCiviello, RLConway, CMCook, DADavis, CDMacci, RPin, SSRen, SXSchartman, RSignor, LJThalody, GWidmann, KAXu, CChaturvedula, PVMacor, JEDubowchik, GM The synthesis and SAR of calcitonin gene-related peptide (CGRP) receptor antagonists derived from tyrosine surrogates. Part 1. Bioorg Med Chem Lett22:4723-7 (2012) 
 
Calcitonin gene-related peptide type 1 receptor
Name:Calcitonin gene-related peptide type 1 receptor
Type:Enzyme Catalytic Domain
Mol. Mass.:52980.45
Organism:Homo sapiens (Human)
Description:Q16602
Residue:461
BDBM50387500
NameBDBM50387500
Synonyms:CHEMBL2059800
TypeSmall organic molecule
Emp. Form.C38H46N6O3
Mol. Mass.634.8102
SMILESO=C(N[C@H](Cc1ccc(cc1)-c1ccccc1)C(=O)N1CCC(CC1)N1CCCCC1)N1CCC(CC1)n1c2ccccc2[nH]c1=O