Reaction Details
TargetCalcitonin gene-related peptide type 1 receptor
LigandBDBM50387524
Substrate/Competitorn/a
Meas. Tech.ChEMBL_830181 (CHEMBL2062031)
EC50 31±n/a nM
Citation Chaturvedula, PVPin, STholady, GConway, CMMacor, JEDubowchik, GM Design and synthesis of potent antagonists containing rigid spirocyclic privileged structures for the CGRP receptor. Bioorg Med Chem Lett22:4719-22 (2012) 
 
Calcitonin gene-related peptide type 1 receptor
Name:Calcitonin gene-related peptide type 1 receptor
Type:Enzyme Catalytic Domain
Mol. Mass.:52980.45
Organism:Homo sapiens (Human)
Description:Q16602
Residue:461
BDBM50387524
NameBDBM50387524
Synonyms:CHEMBL2059905
TypeSmall organic molecule
Emp. Form.C34H41N5O4S
Mol. Mass.615.785
SMILESO=C(N[C@H](Cc1csc2ccccc12)C(=O)N1CCC(CC1)N1CCCCC1)N1CCC2(CC1)OC(=O)Nc1ccccc21