Reaction Details
TargetPhosphatidylinositol 4,5-bisphosphate 3-kinase catalytic subunit gamma isoform
LigandBDBM50387541
Substrate/Competitorn/a
Meas. Tech.ChEMBL_830191 (CHEMBL2062041)
IC50 2.51±n/a nM
Citation Ellard, KSunose, MBell, KRamsden, NBergamini, GNeubauer, G Discovery of novel PI3K¿/d inhibitors as potential agents for inflammation. Bioorg Med Chem Lett22:4546-9 (2012) 
 
Phosphatidylinositol 4,5-bisphosphate 3-kinase catalytic subunit gamma isoform
Name:Phosphatidylinositol 4,5-bisphosphate 3-kinase catalytic subunit gamma isoform
Type:Enzyme Subunit
Mol. Mass.:126470.30
Organism:Homo sapiens (Human)
Description:P48736
Residue:1102
BDBM50387541
NameBDBM50387541
Synonyms:CHEMBL2057368
TypeSmall organic molecule
Emp. Form.C22H27N11O3S
Mol. Mass.525.587
SMILESCC(C)(C)NS(=O)(=O)c1cncc(c1)-c1ccc2nc(NC(=O)NCCn3nnc(n3)C3CC3)nn2c1