Reaction Details
TargetD(2) dopamine receptor
LigandBDBM50387557
Substrate/Competitorn/a
Meas. Tech.ChEMBL_830333 (CHEMBL2060922)
IC50 456.13±n/a nM
Citation Qian, WLu, WSun, HLi, ZZhu, LZhao, RZhang, LZhou, SZhou, YJiang, HZhen, XLiu, H Design, synthesis, and pharmacological evaluation of novel tetrahydroprotoberberine derivatives: selective inhibitors of dopamine D1 receptor. Bioorg Med Chem20:4862-71 (2012) 
 
D(2) dopamine receptor
Name:D(2) dopamine receptor
Type:Cell-surface receptors
Mol. Mass.:50647.10
Organism:Homo sapiens (Human)
Description:P14416
Residue:443
BDBM50387557
NameBDBM50387557
Synonyms:CHEMBL2057457 | US9359372, DC037031
TypeSmall organic molecule
Emp. Form.C20H23NO2
Mol. Mass.309.4021
SMILESCOc1cc2CCN3Cc4c(C)cc(C)cc4C[C@H]3c2cc1O