Reaction Details
TargetD(2) dopamine receptor
LigandBDBM50378584
Substrate/Competitorn/a
Meas. Tech.ChEMBL_830333 (CHEMBL2060922)
Ki 56.17±n/a nM
Citation Qian, WLu, WSun, HLi, ZZhu, LZhao, RZhang, LZhou, SZhou, YJiang, HZhen, XLiu, H Design, synthesis, and pharmacological evaluation of novel tetrahydroprotoberberine derivatives: selective inhibitors of dopamine D1 receptor. Bioorg Med Chem20:4862-71 (2012) 
 
D(2) dopamine receptor
Name:D(2) dopamine receptor
Type:Cell-surface receptors
Mol. Mass.:50647.10
Organism:Homo sapiens (Human)
Description:P14416
Residue:443
BDBM50378584
NameBDBM50378584
Synonyms:STEPHOLIDINE
TypeSmall organic molecule
Emp. Form.C19H21NO4
Mol. Mass.327.3743
SMILESCOc1cc2CCN3Cc4c(C[C@H]3c2cc1O)ccc(O)c4OC