Reaction Details
TargetD(1A) dopamine receptor
LigandBDBM50387565
Substrate/Competitorn/a
Meas. Tech.ChEMBL_830331 (CHEMBL2060920)
IC50 141.58±n/a nM
Citation Qian, WLu, WSun, HLi, ZZhu, LZhao, RZhang, LZhou, SZhou, YJiang, HZhen, XLiu, H Design, synthesis, and pharmacological evaluation of novel tetrahydroprotoberberine derivatives: selective inhibitors of dopamine D1 receptor. Bioorg Med Chem20:4862-71 (2012) 
 
D(1A) dopamine receptor
Name:D(1A) dopamine receptor
Type:Enzyme
Mol. Mass.:49303.43
Organism:Homo sapiens (Human)
Description:P21728
Residue:446
BDBM50387565
NameBDBM50387565
Synonyms:CHEMBL2057443 | US9359372, DC037078
TypeSmall organic molecule
Emp. Form.C20H21NO4
Mol. Mass.339.385
SMILESCOc1cc2C[C@@H]3N(CCc4cc5OCOc5cc34)Cc2c(OC)c1